BDBM50468883 CHEMBL4278781
SMILES OC(=O)Cc1ccc(cc1)N(Cc1ccc2ccccc2c1)S(=O)(=O)c1ccc(cc1)-c1ccccc1
InChI Key InChIKey=HKTATCCIIYLNSC-UHFFFAOYSA-N
Data  3 IC50
  Tab Delimited (TSV)   2D SDfile   Computed 3D by Vconf -m prep SDfile
Find this compound or compounds like it in BindingDB:
Activity Spreadsheet -- Enzyme Inhibition Constant Data from BindingDB
Found 2 hits for monomerid = 50468883
TargetPolyunsaturated fatty acid 5-lipoxygenase(Homo sapiens (Human))
Goethe-University Frankfurt
Curated by ChEMBL
LigandPNGBDBM50468883(CHEMBL4278781)
Affinity DataIC50:  3.40E+3nM. Assay description: Inhibition of 5-LO in human neutrophils using arachidonic acid as substrate assessed as reduction in 5-LO product formation preincubated for 15 mins ...
Ligand InfoKEGGPC cidPC sid
In DepthDetails ArticlePubMed
TargetPolyunsaturated fatty acid 5-lipoxygenase(Homo sapiens (Human))
Goethe-University Frankfurt
Curated by ChEMBL
LigandPNGBDBM50468883(CHEMBL4278781)
Affinity DataIC50:  8.70E+3nM. Assay description: Inhibition of recombinant human 5-LO expressed in Escherichia coli BL21 (DE3) using arachidonic acid as substrate preincubated for 10 mins followed b...
Ligand InfoKEGGPC cidPC sid
In DepthDetails ArticlePubMed